BDBM50368057 NSC-286193::TIAZOFURINE
SMILES NC(=O)c1csc(n1)[C@@H]1O[C@H](CO)[C@@H](O)[C@H]1O
InChI Key InChIKey=FVRDYQYEVDDKCR-DBRKOABJSA-N
Data  2 KI
PDB links: 2 PDB IDs match this monomer.
  Tab Delimited (TSV)   2D SDfile   Computed 3D by Vconf -m prep SDfile
Find this compound or compounds like it in BindingDB:
Activity Spreadsheet -- Enzyme Inhibition Constant Data from BindingDB
Found 1 hit for monomerid = 50368057
TargetGlutamate dehydrogenase 1, mitochondrial(Bos taurus)
University Of Rochester Medical Center
Curated by ChEMBL
LigandPNGBDBM50368057(NSC-286193 | TIAZOFURINE)
Affinity DataKi: >1.00E+7nM. Assay description: In vitro inhibitory activity against bovine liver glutamate dehydrogenase (GDH)
In DepthDetails ArticlePubMed